{"text_format":"1","workbook":"xlsx","n_sheets":11,"sheets":["Read First","Provider Names","PC Totals","Ideal Panel Size","TNA","Daily Measures","No Shows","Backlog Reduction","Summary Graphs","Copyright","DropDown"],"not_rendered":{"charts":10,"images":7,"macros":1,"external_links":1,"defined_names":7,"comments":0,"pivot_tables":6},"unopened":[],"bounds":{"document_bytes":16777216,"sheet_cells":100000,"rows_first":2000,"rows_last":500,"rows_between":2000,"halvings":0,"cell_chars":16384,"cell_head_chars":4096},"cells_cut":0,"cells_raw":0,"read":"whole","date_system":"1900"}

{"sheet":"Read First","index":0,"n_rows":10,"n_cols":6,"rows_kept":10,"cut":false,"hidden":false,"merged":[[0,1,1,3],[6,5,6,6],[2,1,2,3],[3,1,3,3],[4,1,4,3],[5,1,7,3],[2,5,2,6],[3,5,3,6],[4,5,4,6],[5,5,5,6],[8,1,8,3],[7,5,16,6],[9,1,16,3],[18,1,18,6],[21,1,21,6],[20,1,20,6]]}
[null,"Access Measures Tracker"]
[]
[null,"Introduction",null,null,null,"Technical Instructions"]
[null,"Use this workbook to record, calculate, and visualize key measures for access improvement for one or more providers. This tool is also for those who just want to calculate ideal panel size.\n\nKey measures: Ideal panel size, and third next available appointment (TNA). \n\nThis workbook can track and calculate additional measures that may be helpful. These are:  No-shows;  daily demand, supply and activity; and backlog reduction.",null,null,null,"IMPORTANT: \n1. Open this file in the Desktop Version of Excel to enable all features. \n2. Click 'Enable Content'.\n3. Enable Macros in order to display the Summary Graphs\n\n\n\n\n\n\n"]
[null,"What is in each tab?",null,null,null,"Tips for entering data:\n"]
[null,"Provider names: This is where you enter the names of the provider(s) you are tracking. \n\nIdeal panel size: Calculate and compare ideal panel sizes.\n\nTNA: Record third next available appointment for each provider. If multiple values are collected over time, these will be visualized in the Summary Graphs tab.\n\nDaily Measures: Track daily demand, supply, and activity. These are not always needed. If multiple values are collected over time, these will be visualized in the Summary Graphs tab.\n\nNo-Shows: Calculate no-show rates. If multiple values are collected over time, these will be visualized in the Summary Graphs tab.\n\nBacklog Reduction: Calculate the impact of temporarily adding supply in order to reduce backlog.\n\nSummary Graphs: Generate run charts to visualize trends in TNA, daily measures and no-shows."]
[null,null,null,null,null,"Filtering Run Charts:"]
[]
[null,"Copyright"]
[null,"This work has been created by the Alberta Medical Association's Accelerating Change Transformation Team (ACTT) based on work from Alberta Health Services and a concept by Mark Murray & Associates.\t\n\nThis work is licensed under the Creative Commons Attribution-NonCommercial 4.0 International License. To view a copy of this license, visit http://creativecommons.org/licenses/by-nc/4.0/ \t\n\t\t\t\t\nAlberta Medical Association expressly disclaims all liability for the use of these materials, and for any claims, actions, demands or suits arising from such use. The Alberta Medical Association does not endorse, in any way, derivative or excerpted materials based on this product and cannot be held accountable for any such adapted product."]
{"$rows_left_out":1}
{"sheet":"Provider Names","index":1,"n_rows":4,"n_cols":4,"rows_kept":4,"cut":false,"hidden":false,"merged":[[3,3,5,7]]}
[null,"Please list your clinicians to be included below:"]
[]
[null,null,null,"What does this tab do?"]
[null,null,null,"The provider names you list in the green cells will appear as a dropdown list you can choose from for the tabs where measures are collected."]

{"sheet":"PC Totals","index":2,"n_rows":6,"n_cols":110,"rows_kept":6,"cut":false,"hidden":true,"merged":[]}
["Provider","(blank)",null,null,null,null,null,null,null,null,null,null,null,null,null,"Provider","(blank)",null,null,null,null,null,null,null,null,null,null,null,null,"Provider","(blank)",null,null,null,null,null,null,null,null,"Average of Third Next Available (TNA)","Column Labels",null,null,null,null,null,null,null,null,null,null,null,null,null,null,null,null,null,null,null,null,null,null,null,null,null,null,null,null,null,null,null,null,null,null,null,null,null,null,null,null,null,null,null,null,null,null,null,null,null,null,null,null,null,null,null,null,null,null,null,null,null,null,null,null,null,null,null,"Column Labels"]
["Day","(All)",null,null,null,null,null,null,null,null,null,null,null,null,null,"Date","(blank)",null,null,null,null,null,null,null,null,null,null,null,null,"Day",null,null,null,null,null,null,null,null,null,"Row Labels","(blank)","Grand Total",null,null,null,null,null,null,null,null,null,null,null,null,null,null,null,null,null,null,null,null,null,null,null,null,null,null,null,null,null,null,null,null,null,null,null,null,null,null,null,null,null,null,null,null,null,null,null,null,null,null,null,null,null,null,null,null,null,null,null,null,null,null,null,null,null,"Row Labels","(blank)","Grand Total"]
[null,null,null,null,null,null,null,null,null,null,null,null,null,null,null,null,null,null,null,null,null,null,null,null,null,null,null,null,null,null,null,null,null,null,null,null,null,null,null,"(blank)",null,null,null,null,null,null,null,null,null,null,null,null,null,null,null,null,null,null,null,null,null,null,null,null,null,null,null,null,null,null,null,null,null,null,null,null,null,null,null,null,null,null,null,null,null,null,null,null,null,null,null,null,null,null,null,null,null,null,null,null,null,null,null,null,null,null,null,"(blank)"]
["Row Labels","Supply.","Activity","Demand",null,null,null,null,null,null,null,null,null,null,null,"Row Labels","Average Supply","Average Activity",null,null,null,null,null,null,null,null,null,null,null,"Row Labels","Percent of Demand which is Internal",null,null,null,null,null,null,null,null,"Grand Total",null,null,null,null,null,null,null,null,null,null,null,null,null,null,null,null,null,null,null,null,null,null,null,null,null,null,null,null,null,null,null,null,null,null,null,null,null,null,null,null,null,null,null,null,null,null,null,null,null,null,null,null,null,null,null,null,null,null,null,null,null,null,null,null,null,null,null,"Grand Total"]
["(blank)",null,0,null,null,null,null,null,null,null,null,null,null,null,null,null,null,{"$error":"#DIV/0!"},null,null,null,null,null,null,null,null,null,null,null,"(blank)",{"$error":"#NAME?"}]
["Grand Total",null,0,null,null,null,null,null,null,null,null,null,null,null,null,"Grand Total",null,{"$error":"#DIV/0!"},null,null,null,null,null,null,null,null,null,null,null,"Grand Total",{"$error":"#NAME?"}]

{"sheet":"Ideal Panel Size","index":3,"n_rows":51,"n_cols":14,"rows_kept":51,"cut":false,"hidden":false,"merged":[[6,11,7,19],[2,1,3,1],[2,11,2,13],[2,16,4,20],[8,11,40,19],[0,1,0,9],[1,1,1,9],[2,2,2,4],[2,8,2,9],[2,5,2,7]]}
[null,"Ideal Panel Size Calculator"]
[]
[null,"Provider","Annual Demand",null,null,"Annual Supply",null,null,"Panel Information",null,null,"Clinic Level"]
[null,null,"Current Panel Size","RVR \n(Average Visits to any family physician)","Patient Visits per Year","Average Appt Slots per Week","Weeks Worked per Year","Potential Appt Supply","Ideal Target Panel","Over (Under) Ideal Target",null,"Clinic Panel Size","Clinic Return Visit Rate","Clinic Ideal Panel Size"]
[null,{"$f":"_xlfn._xlws.FILTER('Provider Names'!B2:B200,'Provider Names'!B2:B200>1)","v":{"$error":"#VALUE!"}},null,null,{"$f":"IF(C5>0,C5*D5,\"\")","v":""},null,null,{"$f":"IF(B5>1,F5*G5,\"\")","v":{"$error":"#VALUE!"}},{"$f":"IF(C5>0,H5/D5,\"\")","v":""},{"$f":"IF(C5>0,C5-I5,\"\")","v":""},null,{"$f":"IF(SUM(C5:C51)>1,SUM(C5:C51),\"\")","v":""},{"$f":"IF(SUM(E5:E51)>0,(SUM(E5:E51))/(SUM(C5:C51)),\"\")","v":""},{"$f":"IF(SUM(H5:H51)>0,SUM(H5:H51)/M5,\"\")","v":{"$error":"#VALUE!"}}]
[null,null,null,null,{"$f":"IF(C6>0,C6*D6,\"\")","v":""},null,null,{"$f":"IF(B6>1,F6*G6,\"\")","v":""},{"$f":"IF(C6>0,H6/D6,\"\")","v":""},{"$f":"IF(C6>0,C6-I6,\"\")","v":""}]
[null,null,null,null,"",null,null,"","","",null,"Instructions:\n"]
[null,null,null,null,"",null,null,"","",""]
[null,null,null,null,"",null,null,"","","",null,"For each row: \n1. Provider. Column B: The providers will be automatically brought in from the \"Provider Names\" tab.\n\n2. Current Panel Size. Column C: Enter the number of patients currently on the provider's panel. The Health Quality Council of Alberta (HQCA) Primary Healthcare Panel Report is a good source.This can also be obtained from the Electronic Medical Record (EMR).\n\n3. Return Visit Rate (RVR). Column D: Enter the average number of visits a patient has had with any family medicine physician in the past year. Use the \"Average visits to any family physician\" value from the HQCA Primary Healthcare Panel Report. \n\n4. Patient Visits per Year. Column E: Calculated for you. Annual demand. Shows the number of visits paneled patients require per year. Calculated as: Current Panel Size x RVR.\n\n5. Average Appointment Slots per Week. Column F: Using the clinic's EMR, enter the number of appointment slots offered by this provider in a typical week. \n\n6. Weeks Worked per Year. Column G: Using the clinic's EMR or calendar, enter the number of weeks in a year the provider is usually in the clinic. An estimate can be determined by starting with 52 weeks and subtracting vacations, statutory holidays, sick days, and other expected time away from the clinic.\n\n7. Potential Appointment Supply. Column H: Calculated for you. Annual demand. Estimates the supply of appointments in a year. Calculated as: Provider visits per week x weeks worked per year.\n\n8. Ideal Target Panel. Column I: Calculated for you. Identifies the provider's ideal panel size given the data provided. Calculated as: Potential Supply of Appointments / RVR.\n\n9. Over (Under) Ideal Target. Column J: Calculated for you. Shows if a provider is over or under panelled, based on their balance of demand & supply. Calculated as: Current Panel Size - Ideal Target Panel. \n\nNote: Consider revisiting this annually, unless something changes."]
[null,null,null,null,"",null,null,"","",""]
{"$rows_left_out":42}
{"sheet":"TNA","index":4,"n_rows":5,"n_cols":8,"rows_kept":5,"cut":false,"hidden":false,"merged":[[4,4,4,5],[3,4,3,5],[0,0,0,2],[1,7,2,13],[3,7,14,13]]}
["TNA Tracker",null,null,null,"Use this to calculate number of days if needed"]
["Date","Provider","Third Next Available (TNA)",null,"Date of measurement:","Date of TNA:",null,"Instructions"]
[null,null,null,null,"2024-11-05","2024-11-06"]
[null,null,null,null,"Number of days",null,null,"For each row: \n1. Date. Column A: Enter the date. Format: dd-MON-yy. Eg. 18 Jan 25\n2. Provider. Column B: Select provider from the dropdown list\n3. Third Next Available. Column C: Using the clinic's EMR, count the days until the third open appointment slot, with today being zero, and include days the clinic is closed. The time slot counted should be for the typical or shortest appointment slot, excluding carve-outs.  \n\nTo track trends over time, enter future values in the rows below, measuring the same day and time each week, and your results can be viewed as a run chart by clicking on the Summary Graphs tab."]
[null,null,null,null,{"$f":"F3-E3","v":1}]

{"sheet":"Daily Measures","index":5,"n_rows":7,"n_cols":10,"rows_kept":7,"cut":false,"hidden":false,"merged":[[1,9,2,16],[0,0,0,6],[3,9,19,16]]}
["Daily Measurement Tracker"]
["Date","Provider","Demand","Supply","Activity","Day","Activity:\nTotal",null,null,"Instructions"]
[null,null,null,null,null,{"$f":"IF(ISBLANK(Table1[[#This Row],[Date]]),\"\",TEXT(Table1[[#This Row],[Date]],\"ddd\"))","v":""},{"$f":"IF(ISBLANK(Table1[[#This Row],[Date]]),\"\",Table1[[#This Row],[Activity]])","v":""}]
[null,null,null,null,null,{"$f":"IF(ISBLANK(Table1[[#This Row],[Date]]),\"\",TEXT(Table1[[#This Row],[Date]],\"ddd\"))","v":""},{"$f":"IF(ISBLANK(Table1[[#This Row],[Date]]),\"\",Table1[[#This Row],[Activity]])","v":""},null,null,"Note: Tracking daily demand, supply, and activity is optional.  It may be useful in diagnosing your clinic and showing the impact of change. Measure at the end of the day.\n\nFor each row: \n1. Date. Column A: Enter the date. Format: dd-MON-yy. Eg. 18 Jan 25\n2. Provider. Column B: Select provider from the dropdown list\n3. Demand. Column C: Measured by counting the number of time slots of appointments booked today, regardless of when the appointment is booked for, or who booked it. This could be captured by a team member manually making a mark for each appointment request throughout the day, either on a spreadsheet or paper. \n4. Supply. Column D: Using the clinic's EMR, add up the number of time slots offered today. The time slot counted should be for the typical or shortest appointment slot, excluding carve-outs. \n5. Activity. Column E: Using the clinic's EMR, add up the number of time slots used today. The time slot counted should be for the typical or shortest appointment slot.\n\nTo track trends over time, enter future values in the rows below, and your results can be viewed as a run chart by clicking on the Summary Graphs tab."]
[null,null,null,null,null,{"$f":"IF(ISBLANK(Table1[[#This Row],[Date]]),\"\",TEXT(Table1[[#This Row],[Date]],\"ddd\"))","v":""},{"$f":"IF(ISBLANK(Table1[[#This Row],[Date]]),\"\",Table1[[#This Row],[Activity]])","v":""}]
[null,null,null,null,null,{"$f":"IF(ISBLANK(Table1[[#This Row],[Date]]),\"\",TEXT(Table1[[#This Row],[Date]],\"ddd\"))","v":""},{"$f":"IF(ISBLANK(Table1[[#This Row],[Date]]),\"\",Table1[[#This Row],[Activity]])","v":""}]
[null,null,null,null,null,{"$f":"IF(ISBLANK(Table1[[#This Row],[Date]]),\"\",TEXT(Table1[[#This Row],[Date]],\"ddd\"))","v":""},{"$f":"IF(ISBLANK(Table1[[#This Row],[Date]]),\"\",Table1[[#This Row],[Activity]])","v":""}]

{"sheet":"No Shows","index":6,"n_rows":8,"n_cols":20,"rows_kept":8,"cut":false,"hidden":false,"merged":[[0,0,0,5],[1,10,2,15],[3,10,16,15]]}
["No-Show Tracker"]
["Date","Provider","Count of No Shows","Count of Total Appointments","No Show Rate","No-Show Rate","Day",null,null,null,"Instructions"]
[null,null,null,null,{"$f":"IF(Table36[[#This Row],[Date]]>0,Table36[[#This Row],[Count of No Shows]]/Table36[[#This Row],[Count of Total Appointments]],\"\")","v":""},{"$f":"IF(Table36[[#This Row],[Date]]>0,Table36[[#This Row],[Count of No Shows]]/Table36[[#This Row],[Count of Total Appointments]],\"\")","v":""},{"$f":"IF(ISBLANK(Table36[[#This Row],[Date]]),\"\",TEXT(Table36[[#This Row],[Date]],\"ddd\"))","v":""},null,null,null,null,null,null,null,null,null,null,"Day"]
[null,null,null,null,{"$f":"IF(Table36[[#This Row],[Date]]>0,Table36[[#This Row],[Count of No Shows]]/Table36[[#This Row],[Count of Total Appointments]],\"\")","v":""},{"$f":"IF(Table36[[#This Row],[Date]]>0,Table36[[#This Row],[Count of No Shows]]/Table36[[#This Row],[Count of Total Appointments]],\"\")","v":""},{"$f":"IF(ISBLANK(Table36[[#This Row],[Date]]),\"\",TEXT(Table36[[#This Row],[Date]],\"ddd\"))","v":""},null,null,null,"For each row:\n1. Date. Column A: Enter the date. Format: dd-MON-yy. Eg. 18 Jan 25\n2. Provider. Column B: Select provider from the dropdown list\n3.Count of No Shows. Column C: Using the clinic's EMR, enter the number of no-shows for your selected time period. eg. a day,  a week or a month.\n4. Count of Total Appointments. Column D: Using the clinic's EMR, enter the number of booked appointments for the same time period. \n5. No Show Rate. Column E: This is calculated for you as a percentage. \n\nIf you want to track progress or trends over time, enter future values in the rows below, and your results can be viewed as a run chart by clicking on the Summary Graphs tab."]
[null,null,null,null,{"$f":"IF(Table36[[#This Row],[Date]]>0,Table36[[#This Row],[Count of No Shows]]/Table36[[#This Row],[Count of Total Appointments]],\"\")","v":""},{"$f":"IF(Table36[[#This Row],[Date]]>0,Table36[[#This Row],[Count of No Shows]]/Table36[[#This Row],[Count of Total Appointments]],\"\")","v":""},{"$f":"IF(ISBLANK(Table36[[#This Row],[Date]]),\"\",TEXT(Table36[[#This Row],[Date]],\"ddd\"))","v":""},null,null,null,null,null,null,null,null,null,null,"Average of No-Show Rate","Column Labels"]
[null,null,null,null,{"$f":"IF(Table36[[#This Row],[Date]]>0,Table36[[#This Row],[Count of No Shows]]/Table36[[#This Row],[Count of Total Appointments]],\"\")","v":""},{"$f":"IF(Table36[[#This Row],[Date]]>0,Table36[[#This Row],[Count of No Shows]]/Table36[[#This Row],[Count of Total Appointments]],\"\")","v":""},{"$f":"IF(ISBLANK(Table36[[#This Row],[Date]]),\"\",TEXT(Table36[[#This Row],[Date]],\"ddd\"))","v":""},null,null,null,null,null,null,null,null,null,null,"Row Labels","(blank)","Grand Total"]
[null,null,null,null,{"$f":"IF(Table36[[#This Row],[Date]]>0,Table36[[#This Row],[Count of No Shows]]/Table36[[#This Row],[Count of Total Appointments]],\"\")","v":""},{"$f":"IF(Table36[[#This Row],[Date]]>0,Table36[[#This Row],[Count of No Shows]]/Table36[[#This Row],[Count of Total Appointments]],\"\")","v":""},{"$f":"IF(ISBLANK(Table36[[#This Row],[Date]]),\"\",TEXT(Table36[[#This Row],[Date]],\"ddd\"))","v":""},null,null,null,null,null,null,null,null,null,null,"(blank)",{"$error":"#DIV/0!"},{"$error":"#DIV/0!"}]
[null,null,null,null,{"$f":"IF(Table36[[#This Row],[Date]]>0,Table36[[#This Row],[Count of No Shows]]/Table36[[#This Row],[Count of Total Appointments]],\"\")","v":""},{"$f":"IF(Table36[[#This Row],[Date]]>0,Table36[[#This Row],[Count of No Shows]]/Table36[[#This Row],[Count of Total Appointments]],\"\")","v":""},{"$f":"IF(ISBLANK(Table36[[#This Row],[Date]]),\"\",TEXT(Table36[[#This Row],[Date]],\"ddd\"))","v":""},null,null,null,null,null,null,null,null,null,null,"Grand Total",{"$error":"#DIV/0!"},{"$error":"#DIV/0!"}]

{"sheet":"Backlog Reduction","index":7,"n_rows":105,"n_cols":11,"rows_kept":105,"cut":false,"hidden":false,"merged":[[0,0,0,7],[2,5,2,9],[3,10,4,17],[5,10,24,17]]}
["Backlog Reduction Calculator"]
[]
[null,null,"GOAL TNA:",3]
[null,null,null,null,null,null,null,null,null,null,"Instructions"]
[]
["Provider","Date of Most Recent TNA","Most Recent TNA","TNA \n(Only if TNA tab not filled out)","Average scheduled appointments per day","Extra Appointments needed to meet goal TNA","How many extra appts will you add per day?","Clinic days it will take to reach goal",null,null,"IMPORTANT: Providers should first ensure they have balanced their supply and demand for appointments prior to implementing backlog reduction strategies.  This will prevent backlog from reappearing and can help with the number of extra appointments you need to add to reach your goal.\n\n1. Goal TNA. Cell D3: Enter your goal TNA (in days) in Cell D3.\nFor each row:\n2. Provider. Column A: The providers will be automatically brought in from the \"Provider Names\" tab.\n3. Date of Most Recent TNA. Column B: Filled in for you if you have  been using the TNA tab. \n4. Most Recent TNA. Column C: Filled in for you if you have  been using the TNA tab. \n5. TNA. Column D: Only use if you have not been using the TNA tab.\n6. Average Scheduled Appointments Per Day. Column E: Using the clinic's EMR, select a typical day and add up the number of time slots offered. The time slot counted should be for the typical or shortest appointment slot, excluding carve-outs\n7. Extra Appointments Needed to Meet Goal TNA. Column F: Calculated for you.\n8. How many extra Appointments will you add per day. Column G: Enter the number of extra appointment slots the provider is willing to add per day. Can play around with this number.\n9. Clinic days it will take to reach goal Column H: Calculated for you.\n\n"]
[{"$f":"_xlfn._xlws.FILTER('Provider Names'!B2:B200,'Provider Names'!B2:B200>1)","v":{"$error":"#VALUE!"}},{"$f":"IF(_xlfn.MAXIFS(Table3[Date]:Table3[Date],Table3[Provider]:Table3[Provider],'Backlog Reduction'!A7)=0,\"\",_xlfn.MAXIFS(Table3[Date]:Table3[Date],Table3[Provider]:Table3[Provider],'Backlog Reduction'!A7))","v":""},{"$f":"IF(COUNTIF(Table3[Provider]:Table3[Provider],'Backlog Reduction'!A7)>0,(_xlfn.XLOOKUP(1,(Table3[Date]:Table3[Date]=B7)*(Table3[Provider]:Table3[Provider]=A7),Table3[Third Next Available (TNA)]:Table3[Third Next Available (TNA)])),\"\")","v":""},null,null,{"$f":"IF(A7>0,IF(ISBLANK(D7),(C7-$D$3)*E7,(D7-$D$3)*E7),\"\")","v":{"$error":"#VALUE!"}},null,{"$f":"IF(A7>0,IF(G7>0,F7/G7,\"\"),\"\")","v":{"$error":"#VALUE!"}}]
[null,{"$f":"IF(_xlfn.MAXIFS(Table3[Date]:Table3[Date],Table3[Provider]:Table3[Provider],'Backlog Reduction'!#REF!)=0,\"\",_xlfn.MAXIFS(Table3[Date]:Table3[Date],Table3[Provider]:Table3[Provider],'Backlog Reduction'!#REF!))","v":""},{"$f":"IF(COUNTIF(Table3[Provider]:Table3[Provider],'Backlog Reduction'!#REF!)>0,(_xlfn.XLOOKUP(1,(Table3[Date]:Table3[Date]=B8)*(Table3[Provider]:Table3[Provider]=#REF!),Table3[Third Next Available (TNA)]:Table3[Third Next Available (TNA)])),\"\")","v":""},null,null,{"$f":"IF(A8>0,IF(ISBLANK(D8),(C8-$D$3)*E8,(D8-$D$3)*E8),\"\")","v":""},null,{"$f":"IF(A8>0,IF(G8>0,F8/G8,\"\"),\"\")","v":""}]
[null,{"$f":"IF(_xlfn.MAXIFS(Table3[Date]:Table3[Date],Table3[Provider]:Table3[Provider],'Backlog Reduction'!A9)=0,\"\",_xlfn.MAXIFS(Table3[Date]:Table3[Date],Table3[Provider]:Table3[Provider],'Backlog Reduction'!A9))","v":""},{"$f":"IF(COUNTIF(Table3[Provider]:Table3[Provider],'Backlog Reduction'!A9)>0,(_xlfn.XLOOKUP(1,(Table3[Date]:Table3[Date]=B9)*(Table3[Provider]:Table3[Provider]=A9),Table3[Third Next Available (TNA)]:Table3[Third Next Available (TNA)])),\"\")","v":""},null,null,{"$f":"IF(A9>0,IF(ISBLANK(D9),(C9-$D$3)*E9,(D9-$D$3)*E9),\"\")","v":""},null,""]
[null,{"$f":"IF(_xlfn.MAXIFS(Table3[Date]:Table3[Date],Table3[Provider]:Table3[Provider],'Backlog Reduction'!A10)=0,\"\",_xlfn.MAXIFS(Table3[Date]:Table3[Date],Table3[Provider]:Table3[Provider],'Backlog Reduction'!A10))","v":""},{"$f":"IF(COUNTIF(Table3[Provider]:Table3[Provider],'Backlog Reduction'!A10)>0,(_xlfn.XLOOKUP(1,(Table3[Date]:Table3[Date]=B10)*(Table3[Provider]:Table3[Provider]=A10),Table3[Third Next Available (TNA)]:Table3[Third Next Available (TNA)])),\"\")","v":""},null,null,"",null,""]
{"$rows_left_out":96}
{"sheet":"Summary Graphs","index":8,"n_rows":22,"n_cols":15,"rows_kept":22,"cut":false,"hidden":false,"merged":[]}
["TNA & No-Show Rate",null,null,null,null,null,null,null,null,null,null,null,null,null,"<---- Click grey button each time you update any data "]
[]
[]
[]
[]
[]
[]
[]
[]
[]
{"$rows_left_out":13}
{"sheet":"Copyright","index":9,"n_rows":18,"n_cols":1,"rows_kept":18,"cut":false,"hidden":true,"merged":[]}
[]
["This work has been created by AIM Alberta (A department within Alberta Health Services) based on a concept by Mark Murray & Associates."]
[]
[]
[]
[]
[]
[]
["This work is licensed under the Creative Commons Attribution-NonCommercial 4.0 International License. To view a copy of this license, visit http://creativecommons.org/licenses/by-nc/4.0/ or send a letter to Creative Commons, PO Box 1866, Mountain View, CA 94042, USA."]
[]
{"$rows_left_out":9}
{"sheet":"DropDown","index":10,"n_rows":4,"n_cols":4,"rows_kept":4,"cut":false,"hidden":true,"merged":[]}
["Appointment Types",null,null,"Clinic Type"]
["Primary","Specialty",null,"Primary Care"]
["Internal","New",null,"Specialty Care"]
["External","Return"]